�S���n�������c�̃R�[�h,ID,�n�������c�̖�,����,����_�J�i,����_�p��,����_�ʏ�,POI�R�[�h,�O�����ʎq,�O�����ʎq�̒l,���ݒn_�S���n�������c�̃R�[�h,����ID,���ݒn_�A���\�L,���ݒn_�s���{��,���ݒn_�s�撬��,���ݒn_����,���ݒn_�Ԓn�ȉ�,��������(����),�ܓx,�o�x,���x�̎��,���x�̒l,�d�b�ԍ�,�����ԍ�,�A���惁�[���A�h���X,�A����FormURL,�A������l�i���̑��ASNS�Ȃǁj,�X�֔ԍ�,�@�l�ԍ�,�c�̖�,���p�\�j��,�J�n����,�I������,���p�\���ԓ��L����,����,�Ԉ֎q��,�Ԉ֎q�ݏo,�c�G�ݏo,�o���A�t���[�g�C��,�X���[�v�A�G���x�[�^�A�G�X�J���[�^,�_���u���b�N���̈ړ��x��,�_����Ǐ�ɂ��x��,�ӓ����E����A����������,����,�M�k�Ή�,�D�撓�ԏ�,�I�X�g���C�g�Ή��g�C��,������,���ނւ��R�[�i�[,���H��,�x�r�[�J�[�ݏo,�x�r�[�J�[���p,URL,�摜,�摜_���C�Z���X,���l
222160,222160000000000001,�܈�s,�܈䓌�R�~���j�e�B�Z���^�[,,,��������,,,,222160,,�É����܈�s�L��2506-1,�É���,�܈�s,,,,,,,,,,,,,,,,,09:00,21:30,�J�فF�����@�A���A���L�����������@�فF���T���j���A�j�Փ��A�N���N�n,,,,,,,,,,,,,,,,,,,,,,
222160,222160000000000010,�܈�s,��H���R�~���j�e�B�Z���^�[,,,,,,,222160,,�É����܈�s�~�R63-1,�É���,�܈�s,,,,,,,,,,,,,,,,,09:00,21:30,�J�فF�����@�A���A���L�����������@�فF���T���j���A�j�Փ��A�N���N�n,,,,,,,,,,,,,,,,,,,,,,
222160,222160000000000408,�܈�s,�܈��3���c,,,,,,,222160,,�É����܈�s�L��2281-3,�É���,�܈�s,,,,,,,,,,,,,,,,,,,,,,,,,,,,,,,,,,,,,,,,,
222160,222160000000000409,�܈�s,�܈��4���c,,,,,,,222160,,�É����܈�s�v�\1330-3,�É���,�܈�s,,,,,,,,,,,,,,,,,,,,,,,,,,,,,,,,,,,,,,,,,
222160,222160000000000410,�܈�s,�܈��5���c,,,,,,,222160,,�É����܈�s�L��2505-6,�É���,�܈�s,,,,,,,,,,,,,,,,,,,,,,,,,,,,,,,,,,,,,,,,,
222160,222160000000000411,�܈�s,�܈��6���c,,,,,,,222160,,�É����܈�s���c66-8,�É���,�܈�s,,,,,,,,,,,,,,,,,,,,,,,,,,,,,,,,,,,,,,,,,
222160,222160000000000412,�܈�s,�܈��7���c,,,,,,,222160,,�É����܈�s�F�i147,�É���,�܈�s,,,,,,,,,,,,,,,,,,,,,,,,,,,,,,,,,,,,,,,,,
222160,222160000000000413,�܈�s,�܈��7���c�i�ύڎԁj,,,,,,,222160,,�É����܈�s���326-1,�É���,�܈�s,,,,,,,,,,,,,,,,,,,,,,,,,,,,,,,,,,,,,,,,,
222160,222160000000000414,�܈�s,�܈��8���c,,,,,,,222160,,�É����܈�s����2506-4,�É���,�܈�s,,,,,,,,,,,,,,,,,,,,,,,,,,,,,,,,,,,,,,,,,
222160,222160000000000415,�܈�s,�܈��9���c,,,,,,,222160,,�É����܈�s��R��3-1-7,�É���,�܈�s,,,,,,,,,,,,,,,,,,,,,,,,,,,,,,,,,,,,,,,,,
222160,222160000000000416,�܈�s,�܈��10���c,,,,,,,222160,,�É����܈�s�F��784-10,�É���,�܈�s,,,,,,,,,,,,,,,,,,,,,,,,,,,,,,,,,,,,,,,,,
222160,222160000000000417,�܈�s,��H��1���c,,,,,,,222160,,�É����܈�s��H190-2,�É���,�܈�s,,,,,,,,,,,,,,,,,,,,,,,,,,,,,,,,,,,,,,,,,
222160,222160000000000011,�܈�s,��H���R�~���j�e�B�Z���^�[,,,,,,,222160,,�É����܈�s��410-1,�É���,�܈�s,,,,,,,,,,,,,,,,,09:00,21:30,�J�فF�����@�A���A���L�����������@�فF���T���j���A�j�Փ��A�N���N�n,,,,,,,,,,,,,,,,,,,,,,
222160,222160000000000418,�܈�s,��H��2���c,,,,,,,222160,,�É����܈�s��1044-1,�É���,�܈�s,,,,,,,,,,,,,,,,,,,,,,,,,,,,,,,,,,,,,,,,,
222160,222160000000000419,�܈�s,��H��3���c,,,,,,,222160,,�É����܈�s���a864,�É���,�܈�s,,,,,,,,,,,,,,,,,,,,,,,,,,,,,,,,,,,,,,,,,
222160,222160000000000420,�܈�s,��H��4���c,,,,,,,222160,,�É����܈�s�~�R37,�É���,�܈�s,,,,,,,,,,,,,,,,,,,,,,,,,,,,,,,,,,,,,,,,,
222160,222160000000000421,�܈�s,��H��T���c�i���j,,,,,,,222160,,�É����܈�s��685,�É���,�܈�s,,,,,,,,,,,,,,,,,,,,,,,,,,,,,,,,,,,,,,,,,
222160,222160000000000422,�܈�s,��H��T���c�i���j,,,,,,,222160,,�É����܈�s���2867-1,�É���,�܈�s,,,,,,,,,,,,,,,,,,,,,,,,,,,,,,,,,,,,,,,,,
222160,222160000000000423,�܈�s,��H�h�ЃZ���^�[,,,,,,,222160,,�É����܈�s��H1645-2,�É���,�܈�s,,,,,,,,,,,,,,,,,,,,,,,,,,,,,,,,,,,,,,,,,
222160,222160000000000425,�܈�s,�܈���h����H����,,,,,,,222160,,�É����܈�s�󖼂P�O�S�T�Ԓn,�É���,�܈�s,,,,,,,,,,,,,,,,,,,,,,,,,,,,,,,,,,,,,,,,,
222160,222160000000000426,�܈�s,�܈���h���R��������,,,,,,,222160,,�É����܈�s��R���O���ڂQ�V�Ԓn�̂S,�É���,�܈�s,,,,,,,,,,,,,,,,,,,,,,,,,,,,,,,,,,,,,,,,,
222160,222160000000000012,�܈�s,��H��R�~���j�e�B�Z���^�[,,,�K�Y�R�~���j�e�B�Z���^�[,,,,222160,,�É����܈�s���Y��1044,�É���,�܈�s,,,,,,,,,,,,,,,,,09:00,21:30,�J�فF�����@�A���A���L�����������@�فF���T���j���A�j�Փ��A�N���N�n,,,,,,,,,,,,,,,,,,,,,,
222160,222160000000000451,�܈�s,�c���c�n,,,,,,,222160,,�É����܈�s�c��1-8-7,�É���,�܈�s,,,,,,,,,,,,,,,,,,,,,,,,,,,,,,,,,,,,,,,,,
222160,222160000000000453,�܈�s,�������c�n,,,,,,,222160,,�É����܈�s������17,�É���,�܈�s,,,,,,,,,,,,,,,,,,,,,,,,,,,,,,,,,,,,,,,,,
222160,222160000000000454,�܈�s,���c���c�n,,,,,,,222160,,�É����܈�s���c778-1,�É���,�܈�s,,,,,,,,,,,,,,,,,,,,,,,,,,,,,,,,,,,,,,,,,
222160,222160000000000455,�܈�s,�����c�n�i�s�c�j,,,,,,,222160,,�É����܈�s����2020-1,�É���,�܈�s,,,,,,,,,,,,,,,,,,,,,,,,,,,,,,,,,,,,,,,,,
222160,222160000000000456,�܈�s,�L���c�n,,,,,,,222160,,�É����܈�s����5-2-3,�É���,�܈�s,,,,,,,,,,,,,,,,,,,,,,,,,,,,,,,,,,,,,,,,,
222160,222160000000000457,�܈�s,�����u�c�n,,,,,,,222160,,�É����܈�s��H2168,�É���,�܈�s,,,,,,,,,,,,,,,,,,,,,,,,,,,,,,,,,,,,,,,,,
222160,222160000000000458,�܈�s,�����c�n�i���ǁj,,,,,,,222160,,�É����܈�s����2020-1,�É���,�܈�s,,,,,,,,,,,,,,,,,,,,,,,,,,,,,,,,,,,,,,,,,
222160,222160000000000459,�܈�s,���蓌�c�n,,,,,,,222160,,�É����܈�s����576-1,�É���,�܈�s,,,,,,,,,,,,,,,,,,,,,,,,,,,,,,,,,,,,,,,,,
222160,222160000000000460,�܈�s,����k�c�n,,,,,,,222160,,�É����܈�s����2201-1,�É���,�܈�s,,,,,,,,,,,,,,,,,,,,,,,,,,,,,,,,,,,,,,,,,
222160,222160000000000013,�܈�s,��H�k�R�~���j�e�B�Z���^�[,,,,,,,222160,,�É����܈�s��H2857,�É���,�܈�s,,,,,,,,,,,,,,,,,09:00,21:30,�J�فF�����@�A���A���L�����������@�فF���T���j���A�j�Փ��A�N���N�n,,,,,,,,,,,,,,,,,,,,,,
222160,222160000000000461,�܈�s,�ĊJ���Z��w�O�c�n,,,,,,,222160,,�É����܈�s�������Q�P�[�S,�É���,�܈�s,,,,,,,,,,,,,,,,,,,,,,,,,,,,,,,,,,,,,,,,,
222160,222160000000000462,�܈�s,�ĊJ���Z��L���c�n,,,,,,,222160,,�É����܈�s����5-2-3,�É���,�܈�s,,,,,,,,,,,,,,,,,,,,,,,,,,,,,,,,,,,,,,,,,
222160,222160000000000501,�܈�s,����݂̉ƁA�ӂ�,,,,,,,222160,,�É����܈�s�x�z862�Ԓn�̂Q,�É���,�܈�s,,,,,,,,,,,,,,,,,,,,,,,,,,,,,,,,,,,,,,,,,
222160,222160000000000502,�܈�s,���ی��֌W������,,,,,,,222160,,�É����܈�s�����V�W�R�|�S,�É���,�܈�s,,,,,,,,,,,,,,,,,08:30,17:15,"�܈�s�Љ�����c��i�암�n���x���Z���^�[���j
���c�́@�ӂ��݂肠�˂���",,,,,,,,,,,,,,,,,,,,,,
222160,222160000000000014,�܈�s,�F�����������Z���^�[,,,,,,,222160,,�É����܈�s�F��1121-1,�É���,�܈�s,,,,,,,,,,,,,,,,,08:30,22:00,�فF���T���j���A�j�Փ��A�N���N�n,,,,,,,,,,,,,,,,,,,,,,
222160,222160000000000509,�܈�s,�܈�򉻃Z���^�[,,,,,,,222160,,�É����܈�s�V�r880-1,�É���,�܈�s,,,,,,,,,,,,,,,,,,,,,,,,,,,,,,,,,,,,,,,,,
222160,222160000000000510,�܈�s,�A�N�A�p�[�N������,,,,,,,222160,,�É����܈�s�~�R1111,�É���,�܈�s,,,,,,,,,,,,,,,,,,,,,,,,,,,,,,,,,,,,,,,,,
222160,222160000000000511,�܈�s,�܈�q���Z���^�[,,,,,,,222160,,�É����܈�s����2961�Ԓn,�É���,�܈�s,,,,,,,,,,,,,,,,,,,,,,,,,,,,,,,,,,,,,,,,,
222160,222160000000000512,�܈�s,��������,,,,,,,222160,,�É����܈�s��2134�Ԓn��151,�É���,�܈�s,,,,,,,,,,,,,,,,,,,,,,,,,,,,,,,,,,,,,,,,,
222160,222160000000000513,�܈�s,�����N���[���Z���^�[,,,,,,,222160,,�É����܈�s����6635�Ԓn��192,�É���,�܈�s,,,,,,,,,,,,,,,,,,,,,,,,,,,,,,,,,,,,,,,,,
222160,222160000000000281,�܈�s,�}�����ǂ���,,,,,,,222160,,�É����܈�s�R��5093-13,�É���,�܈�s,,,,,,,,,,,,,,,,,07:15,19:00,�����j�E�j���͋x���i�c�����͓y�j���x���j,,,,,,,,,,,,,,,,,,,,,,
222160,222160000000000153,�܈�s,�܈�s�ό��ē���,,,,,,,222160,,�É����܈�s����1211�Ԓn�̂P,�É���,�܈�s,,,,,,,,,,,,,,,,,09:30,18:00,,,,,,,,,,,,,,,,,,,,,,,
222160,222160000000000283,�܈�s,�܈�k�R�~���j�e�B�n�E�X��R,,,,,,,222160,,�É����܈�s�v�\1227-10,�É���,�܈�s,,,,,,,,,,,,,,,,,,18:15,���w�Z�̊J�Z������w�Z���Z���Ԃ���ߌ�U��15���܂Ł@�������x�Ɂi�āE�~�E�t�x�݁j����ߑO�V��45������ߌ�U��15���܂�,,,,,,,,,,,,,,,,,,,,,,
222160,222160000000000015,�܈�s,�L��R�~���j�e�B�Z���^�[,,,�L��ӂꂠ�����,,,,222160,,�É����܈�s�L��210�Ԓn�̂P,�É���,�܈�s,,,,,,,,,,,,,,,,,08:30,17:15,�؁`�Ηj��(���j���x�فB�������A���j���������̋x���ɊY������ꍇ�͋x�ق��Ȃ��j�@�ٗ��p�͌ߌ�10���܂ŉ\,,,,,,,,,,,,,,,,,,,,,,
222160,222160000000000284,�܈�s,�܈䓌�R�~���j�e�B�n�E�X,,,,,,,222160,,�É����܈�s�L��2317-1,�É���,�܈�s,,,,,,,,,,,,,,,,,,18:15,���w�Z�̊J�Z������w�Z���Z���Ԃ���ߌ�U��15���܂Ł@�������x�Ɂi�āE�~�E�t�x�݁j����ߑO�V��45������ߌ�U��15���܂�,,,,,,,,,,,,,,,,,,,,,,
222160,222160000000000285,�܈�s,�܈䐼�R�~���j�e�B�n�E�X��Q,,,,,,,222160,,�É����܈�s���550-3,�É���,�܈�s,,,,,,,,,,,,,,,,,,18:15,"���w�Z�J�Z���F�w�Z���Z���Ԃ���ߌ�U��15���܂�
�������x�Ɂi�āE�~�E�t�x�݁j�F�ߑO�V��45������ߌ�U��15���܂�",,,,,,,,,,,,,,,,,,,,,,
222160,222160000000000517,�܈�s,�܈��P���c,,,,,,,222160,,�É����܈�s���950-5,�É���,�܈�s,,,,,,,,,,,,,,,,,,,,,,,,,,,,,,,,,,,,,,,,,
222160,222160000000000518,�܈�s,�݂��햲�̋u�����Ǘ���,,,,,,,222160,,�É����܈�s��J,�É���,�܈�s,,,,,,,,,,,,,,,,,08:00,17:00,,,,,,,,,,,,,,,,,,,,,,,
222160,222160000000009999,�܈�s,�܈�s�����̈��,,,����₩�A���[�i,,,,222160,,�É����܈�s�v�\1912�Ԓn�̂P,�É���,�܈�s,,,,,,,,,,,,,,,,,08:30,21:30,"�N���N�n�i12/29~1/3�j�Z�k�c�Ɓi9:00~18:00�j
������R���j���x��",,,,,,,,,,,,,,,,,,,,,,
222160,222160000000000520,�܈�s,�܈���h���ɁE�܈�s�h�ЃZ���^�[,,,,,,,222160,,�É����܈�s���{�Q�X�O�V,�É���,�܈�s,,,,,,,,,,,,,,,,,,,,,,,,,,,,,,,,,,,,,,,,,
222160,222160000000000002,�܈�s,�܈䐼�R�~���j�e�B�Z���^�[,,,�ʉ_��,,,,222160,,�É����܈�s���582,�É���,�܈�s,,,,,,,,,,,,,,,,,09:00,21:30,�J�فF�����@�A���A���L�����������@�فF���T���j���A�j�Փ��A�N���N�n,,,,,,,,,,,,,,,,,,,,,,
222160,222160000000000521,�܈�s,�L��̋u�h�Бq��,,,,,,,222160,,�É����܈�s�L��1056-1,�É���,�܈�s,,,,,,,,,,,,,,,,,,,,,,,,,,,,,,,,,,,,,,,,,
222160,222160000000000016,�܈�s,�����܂��Â���Z���^�[,,,,,,,222160,,�É����܈�s����3-5-11,�É���,�܈�s,,,,,,,,,,,,,,,,,,,�����̌ߑO�X������ߌ�P���A�y�E���E�j��10�����琳�߂܂ŃX�^�b�t�ݒ�,,,,,,,,,,,,,,,,,,,,,,
222160,222160000000000522,�܈�s,�܈��T���c�i�V�j,,,,,,,222160,,�É����܈�s�L��2498-4,�É���,�܈�s,,,,,,,,,,,,,,,,,,,,,,,,,,,,,,,,,,,,,,,,,
222160,222160000000000017,�܈�s,������,,,,,,,222160,,�É����܈�s����2525,�É���,�܈�s,,,,,,,,,,,,,,,,,08:30,17:15,,,,,,,,,,,,,,,,,,,,,,,
222160,222160000000000018,�܈�s,�c���_�������Ǘ��Z���^�[,,,,,,,222160,,�É����܈�s�V�r3078,�É���,�܈�s,,,,,,,,,,,,,,,,,08:30,21:30,���J �� ��   �P���S���`12��28���@�@,,,,,,,,,,,,,,,,,,,,,,
222160,222160000000000019,�܈�s,�����̗��w�V��,,,,,,,222160,,�É����܈�s��R��4-3-7,�É���,�܈�s,,,,,,,,,,,,,,,,,09:00,22:00,�J�فF�����@�A���A���L�����������@�@�����ʃv�[���͌ߌ�X���܂Ł@�فF���T�ؗj���A�j�Փ��A�N���N�n,,,,,,,,,,,,,,,,,,,,,,
222160,222160000000000020,�܈�s,�����[�v���U,,,,,,,222160,,�É����܈�s��1027,�É���,�܈�s,,,,,,,,,,,,,,,,,09:00,22:00,�����A�y�E���E�j���i�������A���T���j���A�N���N�n12��28���`�P���S���͋x�فj,,,,,,,,,,,,,,,,,,,,,,
222160,222160000000000051,�܈�s,�܈�}����,,,,,,,222160,,�É����܈�s������19-1,�É���,�܈�s,,,,,,,,,,,,,,,,,09:30,17:30,�΁E���E�y�E���j���@�����E�ؗj���X�F�R�O�`�P�X�F�O�O,,,,,,,,,,,,,,,,,,,,,,
222160,222160000000000052,�܈�s,��H�}����,,,,,,,222160,,�É����܈�s��976-1,�É���,�܈�s,,,,,,,,,,,,,,,,,09:30,17:30,�Ηj���`���j���i���j���͂P�X�F�O�O�܂Łj�����j���ŏj���J�ٓ��͂P�V�F�R�O���܂�,,,,,,,,,,,,,,,,,,,,,,
222160,222160000000000053,�܈�s,���y�����فi�ߓ��L�O�فj,,,,,,,222160,,�É����܈�s��1021,�É���,�܈�s,,,,,,,,,,,,,,,,,09:00,17:00,�������A���T���j���x�ف@���j���j���̏ꍇ�͊J�ق������y�ї��X���x�ف@�N���N�n�x��,,,,,,,,,,,,,,,,,,,,,,
222160,222160000000000054,�܈�s,���j������,,,,,,,222160,,�É����܈�s��1028�Ԓn,�É���,�܈�s,,,,,,,,,,,,,,,,,09:00,17:00,���ق�4��30���܂ŁB�x�ٓ��F�y�E���E�j���A12��28���`���N��1��4��,,,,,,,,,,,,,,,,,,,,,,
222160,222160000000000102,�܈�s,�܈�̈�Z���^�[,,,,,,,222160,,�É����܈�s��c��267-19,�É���,�܈�s,,,,,,,,,,,,,,,,,08:30,21:30,���j���i12/28�`1/3�j�͋x�فi�������A���j�����j���̏ꍇ�͂��̗����B5/3�y��5/4�����j���̏ꍇ��5/6�j,,,,,,,,,,,,,,,,,,,,,,
222160,222160000000000103,�܈�s,��H�̈�Z���^�[,,,,,,,222160,,�É����܈�s�����}1611-5,�É���,�܈�s,,,,,,,,,,,,,,,,,08:30,21:30,"���j���A�j���́A�ߑO�W��30������ߌ�T���܂�
�Ηj���i12/28�`1/3�j�͋x�فi�������A�Ηj�����j���̏ꍇ�͂��̗����B5/3�y��5/4���Ηj���̏ꍇ��5/6�j",,,,,,,,,,,,,,,,,,,,,,
222160,222160000000000104,�܈�s,�܈�a���f�C�m�Z���^�[,,,,,,,222160,,�É����܈�s��c��267-32,�É���,�܈�s,,,,,,,,,,,,,,,,,09:00,21:00,������R���j���i12/28�`1/4�j�͋x��,,,,,,,,,,,,,,,,,,,,,,
222160,222160000000000003,�܈�s,�܈��R�~���j�e�B�Z���^�[,,,�앗��,,,,222160,,�É����܈�s����754-1,�É���,�܈�s,,,,,,,,,,,,,,,,,09:00,21:30,�J�فF�����@�A���A���L�����������@�فF���T���j���A�j�Փ��A�N���N�n,,,,,,,,,,,,,,,,,,,,,,
222160,222160000000000106,�܈�s,��������i�|����A���o�ꓙ�j,,,,,,,222160,,�É����܈�s�L��1727,�É���,�܈�s,,,,,,,,,,,,,,,,,08:30,21:30,"���j���A�j���́A�ߑO�W��30������ߌ�T���܂�
���j���i12/28�`1/3�j�͋x�فi�������A���j�����j���̏ꍇ�͂��̗����B5/3�y��5/4�����j���̏ꍇ��5/6�j",,,,,,,,,,,,,,,,,,,,,,
222160,222160000000000107,�܈�s,�����̋u,,,,,,,222160,,�É����܈�s����6635-8,�É���,�܈�s,,,,,,,,,,,,,,,,,09:00,21:30,�i���p���ԁF�v�[���E�g���[�j���O���E�t�B�b�g�l�X���E���ړI��9�F00�`21�F00�A����10�F00�`21�F00�j���T�Ηj���A�N���N�n�i12/28�`1/4�j�x�ف@�@�@�@�@�@�@�@�@�@�@�@�@�@�@�@�@�@�@�@�@�@�@�@�@�@�@�@�@�@�@�@�@�@�@�@�@�@�@�@�@�@�@�@�@�@�@,,,,,,,,,,,,,,,,,,,,,,
222160,222160000000000151,�܈�s,�V���o�[���[�N�v���U,,,,,,,222160,,�É����܈�s�v�\1287-1,�É���,�܈�s,,,,,,,,,,,,,,,,,08:30,17:15,�y�j���E���j���E�j���F�x��,,,,,,,,,,,,,,,,,,,,,,
222160,222160000000000152,�܈�s,�J���ҕ����Z���^�[,,,,,,,222160,,�É����܈�s��c��267-5,�É���,�܈�s,,,,,,,,,,,,,,,,,09:00,21:30,���J�ٓ��@�P���S���`12��27���܂ŁB�������A������S���j���͏����B,,,,,,,,,,,,,,,,,,,,,,
222160,222160000000000201,�܈�s,�܈䓌���w�Z,,,,,,,222160,,�É����܈�s�L��2317-1,�É���,�܈�s,,,,,,,,,,,,,,,,,08:15,16:45,�����@���y�j�E���j�E�j���@�x�Z,,,,,,,,,,,,,,,,,,,,,,
222160,222160000000000202,�܈�s,�܈䐼���w�Z,,,,,,,222160,,�É����܈�s���442,�É���,�܈�s,,,,,,,,,,,,,,,,,08:15,16:45,�����@���y�j�E���j�E�j���@�x�Z,,,,,,,,,,,,,,,,,,,,,,
222160,222160000000000203,�܈�s,�܈�쏬�w�Z,,,,,,,222160,,�É����܈�s����740,�É���,�܈�s,,,,,,,,,,,,,,,,,08:15,16:45,�����@���y�j�E���j�E�j���@�x�Z,,,,,,,,,,,,,,,,,,,,,,
222160,222160000000000204,�܈�s,�܈�k���w�Z,,,,,,,222160,,�É����܈�s�v�\1580,�É���,�܈�s,,,,,,,,,,,,,,,,,08:15,16:45,�����@���y�j�E���j�E�j���@�x�Z,,,,,,,,,,,,,,,,,,,,,,
222160,222160000000000205,�܈�s,���䏬�w�Z,,,,,,,222160,,�É����܈�s���c692,�É���,�܈�s,,,,,,,,,,,,,,,,,08:15,16:45,�����@���y�j�E���j�E�j���@�x�Z,,,,,,,,,,,,,,,,,,,,,,
222160,222160000000000206,�܈�s,�O�쏬�w�Z,,,,,,,222160,,�É����܈�s�F�i38,�É���,�܈�s,,,,,,,,,,,,,,,,,08:15,16:45,�����@���y�j�E���j�E�j���@�x�Z,,,,,,,,,,,,,,,,,,,,,,
222160,222160000000000004,�܈�s,�܈�k�R�~���j�e�B�Z���^�[,,,,,,,222160,,�É����܈�s�v�\1330-2,�É���,�܈�s,,,,,,,,,,,,,,,,,09:00,21:30,�J�فF�����@�A���A���L�����������@�فF���T���j���A�j�Փ��A�N���N�n,,,,,,,,,,,,,,,,,,,,,,
222160,222160000000000207,�܈�s,�}�����w�Z,,,,,,,222160,,�É����܈�s�R��4822,�É���,�܈�s,,,,,,,,,,,,,,,,,08:15,16:45,�����@���y�j�E���j�E�j���@�x�Z,,,,,,,,,,,,,,,,,,,,,,
222160,222160000000000208,�܈�s,�R�����w�Z,,,,,,,222160,,�É����܈�s�t��684,�É���,�܈�s,,,,,,,,,,,,,,,,,08:15,16:45,�����@���y�j�E���j�E�j���@�x�Z,,,,,,,,,,,,,,,,,,,,,,
222160,222160000000000209,�܈�s,���쏬�w�Z,,,,,,,222160,,�É����܈�s��c��306-2,�É���,�܈�s,,,,,,,,,,,,,,,,,08:15,16:45,�����@���y�j�E���j�E�j���@�x�Z,,,,,,,,,,,,,,,,,,,,,,
222160,222160000000000210,�܈�s,��H�����w�Z,,,,,,,222160,,�É����܈�s��H2800,�É���,�܈�s,,,,,,,,,,,,,,,,,08:15,16:45,�����@���y�j�E���j�E�j���@�x�Z,,,,,,,,,,,,,,,,,,,,,,
222160,222160000000000211,�܈�s,��H�쏬�w�Z,,,,,,,222160,,�É����܈�s�����}148,�É���,�܈�s,,,,,,,,,,,,,,,,,08:15,16:45,�����@���y�j�E���j�E�j���@�x�Z,,,,,,,,,,,,,,,,,,,,,,
222160,222160000000000212,�܈�s,��H�k���w�Z,,,,,,,222160,,�É����܈�s��H1322,�É���,�܈�s,,,,,,,,,,,,,,,,,08:15,16:45,�����@���y�j�E���j�E�j���@�x�Z,,,,,,,,,,,,,,,,,,,,,,
222160,222160000000000213,�܈�s,�܈䒆�w�Z,,,,,,,222160,,�É����܈�s���701,�É���,�܈�s,,,,,,,,,,,,,,,,,08:15,16:45,�����@���y�j�E���j�E�j���@�x�Z,,,,,,,,,,,,,,,,,,,,,,
222160,222160000000000214,�܈�s,���쒆�w�Z,,,,,,,222160,,�É����܈�s���R��1-1-1,�É���,�܈�s,,,,,,,,,,,,,,,,,08:15,16:45,�����@���y�j�E���j�E�j���@�x�Z,,,,,,,,,,,,,,,,,,,,,,
222160,222160000000000215,�܈�s,�܈�쒆�w�Z,,,,,,,222160,,�É����܈�s����3110,�É���,�܈�s,,,,,,,,,,,,,,,,,08:15,16:45,�����@���y�j�E���j�E�j���@�x�Z,,,,,,,,,,,,,,,,,,,,,,
222160,222160000000000216,�܈�s,��H���w�Z,,,,,,,222160,,�É����܈�s��822,�É���,�܈�s,,,,,,,,,,,,,,,,,08:15,16:45,�����@���y�j�E���j�E�j���@�x�Z,,,,,,,,,,,,,,,,,,,,,,
222160,222160000000000005,�܈�s,����R�~���j�e�B�Z���^�[,,,,,,,222160,,�É����܈�s���c687,�É���,�܈�s,,,,,,,,,,,,,,,,,09:00,21:30,�J�فF�����@�A���A���L�����������@�فF���T���j���A�j�Փ��A�N���N�n,,,,,,,,,,,,,,,,,,,,,,
222160,222160000000000217,�܈�s,�܈�w�Z���H�Z���^�[,,,,,,,222160,,�É����܈�s�[��237,�É���,�܈�s,,,,,,,,,,,,,,,,,08:00,16:45,���`���i�j�Փ��E�N���N�n�������j,,,,,,,,,,,,,,,,,,,,,,
222160,222160000000000218,�܈�s,��H�w�Z���H�Z���^�[,,,,,,,222160,,�É����܈�s�V�x166-3,�É���,�܈�s,,,,,,,,,,,,,,,,,08:00,16:45,���`���i�j�Փ��E�N���N�n�������j,,,,,,,,,,,,,,,,,,,,,,
222160,222160000000000219,�܈�s,�����w�Z���H�Z���^�[,,,,,,,222160,,�É����܈�s�L��2289-2,�É���,�܈�s,,,,,,,,,,,,,,,,,08:00,16:45,���`���i�j�Փ��E�N���N�n�������j,,,,,,,,,,,,,,,,,,,,,,
222160,222160000000000220,�܈�s,���C�A�N�V�X�Ō���w�Z,,,,,,,222160,,�É����܈�s��c��267-30,�É���,�܈�s,,,,,,,,,,,,,,,,,08:30,17:15,�����@���y�E���E�j���y�єN���E�N�n�͕Z,,,,,,,,,,,,,,,,,,,,,,
222160,222160000000000251,�܈�s,�܈䓌�c�t��,,,,,,,222160,,�É����܈�s���{2288,�É���,�܈�s,,,,,,,,,,,,,,,,,08:30,17:00,�����@���y�j�E���j�E�j���@�x��,,,,,,,,,,,,,,,,,,,,,,
222160,222160000000000252,�܈�s,�܈䐼�c�t��,,,,,,,222160,,�É����܈�s���568-�P,�É���,�܈�s,,,,,,,,,,,,,,,,,08:30,17:00,�����@���y�j�E���j�E�j���@�x��,,,,,,,,,,,,,,,,,,,,,,
222160,222160000000000253,�܈�s,�c���c�t��,,,,,,,222160,,�É����܈�s�V�r190-1,�É���,�܈�s,,,,,,,,,,,,,,,,,08:30,17:00,�����@���y�j�E���j�E�j���@�x��,,,,,,,,,,,,,,,,,,,,,,
222160,222160000000000255,�܈�s,�ᑐ���ǂ���,,,,,,,222160,,�É����܈�s�x�z766-1,�É���,�܈�s,,,,,,,,,,,,,,,,,07:15,19:00,�����@�����j�E�j���@�x��,,,,,,,,,,,,,,,,,,,,,,
222160,222160000000000256,�܈�s,����c�t��,,,,,,,222160,,�É����܈�s���c723-1,�É���,�܈�s,,,,,,,,,,,,,,,,,08:30,17:00,�����@���y�j�E���j�E�j���@�x��,,,,,,,,,,,,,,,,,,,,,,
222160,222160000000000006,�܈�s,�O��R�~���j�e�B�Z���^�[,,,���񂳂���,,,,222160,,�É����܈�s�F�i147,�É���,�܈�s,,,,,,,,,,,,,,,,,09:00,21:30,�J�فF�����@�A���A���L�����������@�فF���T���j���A�j�Փ��A�N���N�n,,,,,,,,,,,,,,,,,,,,,,
222160,222160000000000257,�܈�s,�O��c�t��,,,,,,,222160,,�É����܈�s�F�i113-1,�É���,�܈�s,,,,,,,,,,,,,,,,,08:30,17:00,�����@���y�j�E���j�E�j���@�x��,,,,,,,,,,,,,,,,,,,,,,
222160,222160000000000259,�܈�s,�R�����ǂ���,,,,,,,222160,,�É����܈�s�t��1-8-7,�É���,�܈�s,,,,,,,,,,,,,,,,,07:15,19:00,�����@�����j�E�j���@�x��,,,,,,,,,,,,,,,,,,,,,,
222160,222160000000000261,�܈�s,��t���ǂ���,,,,,,,222160,,�É����܈�s�v�\1310,�É���,�܈�s,,,,,,,,,,,,,,,,,07:15,19:00,�����@�����j�E�j���@�x��,,,,,,,,,,,,,,,,,,,,,,
222160,222160000000000262,�܈�s,��H�����ǂ���,,,,,,,222160,,�É����܈�s��H2617-1,�É���,�܈�s,,,,,,,,,,,,,,,,,07:15,19:00,�����@�����j�E�j���@�x��,,,,,,,,,,,,,,,,,,,,,,
222160,222160000000000263,�܈�s,��H���c�t��,,,,,,,222160,,�É����܈�s���a873-1,�É���,�܈�s,,,,,,,,,,,,,,,,,08:30,17:00,�����@���y�j�E���j�E�j���@�x��,,,,,,,,,,,,,,,,,,,,,,
222160,222160000000000264,�܈�s,��H��c�t��,,,,,,,222160,,�É����܈�s����1793,�É���,�܈�s,,,,,,,,,,,,,,,,,08:30,17:00,�����@���y�j�E���j�E�j���@�x��,,,,,,,,,,,,,,,,,,,,,,
222160,222160000000000265,�܈�s,��H�k�c�t��,,,,,,,222160,,�É����܈�s��41,�É���,�܈�s,,,,,,,,,,,,,,,,,07:30,18:00,�����@���y�j�E���j�E�j���@�x��,,,,,,,,,,,,,,,,,,,,,,
222160,222160000000000007,�܈�s,�}���R�~���j�e�B�Z���^�[,,,,,,,222160,,�É����܈�s�R��5093-5,�É���,�܈�s,,,,,,,,,,,,,,,,,09:00,21:30,�J�فF�����@�A���A���L�����������@�فF���T���j���A�j�Փ��A�N���N�n,,,,,,,,,,,,,,,,,,,,,,
222160,222160000000000268,�܈�s,�}��������,,,,,,,222160,,�É����܈�s����529-1,�É���,�܈�s,,,,,,,,,,,,,,,,,09:00,17:00,�����E�y�j���F9:00�`17:00�A���j���E�j���F�x��,,,,,,,,,,,,,,,,,,,,,,
222160,222160000000000269,�܈�s,�����q��Ďx���Z���^�[,,,,,,,222160,,�É����܈�s������5-22,�É���,�܈�s,,,,,,,,,,,,,,,,,09:00,18:00,���j���`���j���@���x�ٓ��F��2�E��4���j���y�єN���N�n�i12��29���`�P���R��),,,,,,,,,,,,,,,,,,,,,,
222160,222160000000000270,�܈�s,�e�q�𗬍L��,,,,,,,222160,,�É����܈�s��1027,�É���,�܈�s,,,,,,,,,,,,,,,,,10:00,16:00,�ؗj���`�Ηj���@���x�ٓ��F���j���y�єN���N�n�i12��28���`�P���S���j,,,,,,,,,,,,,,,,,,,,,,
222160,222160000000000271,�܈�s,�܈�k�R�~���j�e�B�n�E�X��P,,,,,,,222160,,�É����܈�s�v�\1508�Ԓn�̂P,�É���,�܈�s,,,,,,,,,,,,,,,,,,18:15,���w�Z�̊J�Z������w�Z���Z���Ԃ���ߌ�U��15���܂Ł@�������x�Ɂi�āE�~�E�t�x�݁j����ߑO�V��45������ߌ�U��15���܂�,,,,,,,,,,,,,,,,,,,,,,
222160,222160000000000272,�܈�s,�܈�k�R�~���j�e�B�n�E�X��Q,,,,,,,222160,,�É����܈�s�x�z�ܒ���18�Ԓn�̂Q,�É���,�܈�s,,,,,,,,,,,,,,,,,,18:15,���w�Z�̊J�Z������w�Z���Z���Ԃ���ߌ�U��15���܂Ł@�������x�Ɂi�āE�~�E�t�x�݁j����ߑO�V��45������ߌ�U��15���܂�,,,,,,,,,,,,,,,,,,,,,,
222160,222160000000000273,�܈�s,�܈��R�~���j�e�B�n�E�X��P,,,,,,,222160,,�É����܈�s����743�Ԓn�̂P,�É���,�܈�s,,,,,,,,,,,,,,,,,,18:15,���w�Z�̊J�Z������w�Z���Z���Ԃ���ߌ�U��15���܂Ł@�������x�Ɂi�āE�~�E�t�x�݁j����ѓy�j������ߑO�V��45������ߌ�U��15���܂�,,,,,,,,,,,,,,,,,,,,,,
222160,222160000000000274,�܈�s,�܈��R�~���j�e�B�n�E�X��Q,,,,,,,222160,,�É����܈�s����2961,�É���,�܈�s,,,,,,,,,,,,,,,,,,18:15,"���w�Z�J�Z���F�w�Z���Z���Ԃ���ߌ�U��15���܂�
�������x�Ɂi�āE�~�E�t�x�݁j�F�ߑO�V��45������ߌ�U��15���܂�",,,,,,,,,,,,,,,,,,,,,,
222160,222160000000000275,�܈�s,�R���R�~���j�e�B�n�E�X,,,,,,,222160,,�É����܈�s�t���꒚�ڂW�Ԓn�̂Q,�É���,�܈�s,,,,,,,,,,,,,,,,,,18:15,���w�Z�̊J�Z������w�Z���Z���Ԃ���ߌ�U��15���܂Ł@�������x�Ɂi�āE�~�E�t�x�݁j����ߑO�V��45������ߌ�U��15���܂�,,,,,,,,,,,,,,,,,,,,,,
222160,222160000000000276,�܈�s,�܈䐼�R�~���j�e�B�n�E�X��P,,,,,,,222160,,�É����܈�s���442�Ԓn,�É���,�܈�s,,,,,,,,,,,,,,,,,,18:15,���w�Z�̊J�Z������w�Z���Z���Ԃ���ߌ�U��15���܂Ł@�������x�Ɂi�āE�~�E�t�x�݁j����ߑO�V��45������ߌ�U��15���܂�,,,,,,,,,,,,,,,,,,,,,,
222160,222160000000000008,�܈�s,�R���R�~���j�e�B�Z���^�[,,,,,,,222160,,�É����܈�s��R��4-3-1,�É���,�܈�s,,,,,,,,,,,,,,,,,09:00,21:30,�J�فF�����@�A���A���L�����������@�فF���T���j���A�j�Փ��A�N���N�n,,,,,,,,,,,,,,,,,,,,,,
222160,222160000000000277,�܈�s,����R�~���j�e�B�n�E�X,,,,,,,222160,,�É����܈�s��c��306�Ԓn�̂Q,�É���,�܈�s,,,,,,,,,,,,,,,,,,18:15,���w�Z�̊J�Z������w�Z���Z���Ԃ���ߌ�U��15���܂Ł@�������x�Ɂi�āE�~�E�t�x�݁j����ߑO�V��45������ߌ�U��15���܂�,,,,,,,,,,,,,,,,,,,,,,
222160,222160000000000278,�܈�s,��H���R�~���j�e�B�n�E�X,,,,,,,222160,,�É����܈�s��H2800�Ԓn,�É���,�܈�s,,,,,,,,,,,,,,,,,,18:15,���w�Z�̊J�Z������w�Z���Z���Ԃ���ߌ�U��15���܂Ł@�������x�Ɂi�āE�~�E�t�x�݁j����ߑO�V��45������ߌ�U��15���܂�,,,,,,,,,,,,,,,,,,,,,,
222160,222160000000000279,�܈�s,�q�ǂ������È�x���Z���^�[�u�͂����݁v,,,,,,,222160,,�É����܈�s����754-1,�É���,�܈�s,,,,,,,,,,,,,,,,,08:30,17:15,,,,,,,,,,,,,,,,,,,,,,,
222160,222160000000000280,�܈�s,�q�ǂ��x�����u�ʂ����v,,,�ʂ���,,,,222160,,�É����܈�s����754-11,�É���,�܈�s,,,,,,,,,,,,,,,,,08:30,17:15,,,,,,,,,,,,,,,,,,,,,,,
222160,222160000000000301,�܈�s,�{��V�l�z�[���u�����v,,,,,,,222160,,�É����܈�s�v�\2995-2,�É���,�܈�s,,,,,,,,,,,,,,,,,,,�N�����x,,,,,,,,,,,,,,,,,,,,,,
222160,222160000000000302,�܈�s,�V�l�����Z���^�[�u���_䵁v,,,,,,,222160,,�É����܈�s�L��1065-5,�É���,�܈�s,,,,,,,,,,,,,,,,,09:00,16:30,�y�j���E���j���E�j���F�x��,,,,,,,,,,,,,,,,,,,,,,
222160,222160000000000303,�܈�s,�}���V�l�����Z���^�[,,,,,,,222160,,�É����܈�s����2150-1,�É���,�܈�s,,,,,,,,,,,,,,,,,09:00,16:30,���j���E���j���E�j���F�x��,,,,,,,,,,,,,,,,,,,,,,
222160,222160000000000304,�܈�s,���܈�s���a�@��t�����Z��,,,,,,,222160,,�É����܈�s�v�\2370-1,�É���,�܈�s,,,,,,,,,,,,,,,,,,,,,,,,,,,,,,,,,,,,,,,,,
222160,222160000000000305,�܈�s,��H�f�C�T�[�r�X�Z���^�[,,,,,,,222160,,�É����܈�s��H4140�Ԓn,�É���,�܈�s,,,,,,,,,,,,,,,,,,,,,,,,,,,,,,,,,,,,,,,,,
222160,222160000000000306,�܈�s,��H�ی��Z���^�[,,,,,,,222160,,�É����܈�s��1028,�É���,�܈�s,,,,,,,,,,,,,,,,,08:30,17:15,�y�j���E���j���E�j���y��12��29���`�P���R���F�x��,,,,,,,,,,,,,,,,,,,,,,
222160,222160000000000009,�܈�s,����R�~���j�e�B�Z���^�[,,,���ڂ���,,,,222160,,�É����܈�s��c��267-8,�É���,�܈�s,,,,,,,,,,,,,,,,,09:00,21:30,�J�فF�����@�A���A���L�����������@�فF���T���j���A�j�Փ��A�N���N�n,,,,,,,,,,,,,,,,,,,,,,
222160,222160000000000307,�܈�s,�}���R�~���j�e�B�Z���^�[�v���U�z�[��,,,,,,,222160,,�É����܈�s�R��5093-5,�É���,�܈�s,,,,,,,,,,,,,,,,,09:00,21:30,�����@�����j���y��12��29���`�P���R���F�x��,,,,,,,,,,,,,,,,,,,,,,
222160,222160000000000308,�܈�s,�������N�Z���^�[,,,,,,,222160,,�É����܈�s�v�\2515-1,�É���,�܈�s,,,,,,,,,,,,,,,,,08:30,17:15,,,,,,,,,,,,,,,,,,,,,,,
222160,222160000000000351,�܈�s,����܈�s���a�@,,,,,,,222160,,�É����܈�s�v�\2515-1,�É���,�܈�s,,,,,,,,,,,,,,,,,08:30,17:00,,,,,,,,,,,,,,,,,,,,,,,